Installing problem in ubuntu 18.04



  • Hi! Is there any way to install HISE to Linux (ubuntu 18.04) without compiling? I'm not a programmer and I was trying to install it following instructions from here:
    https://github.com/christophhart/HISE/
    but without success...

    In the terminal I've got this:

    ~~~~```
    cooltehno@cooltehno-sys:~/HISE/projects/standalone/Builds/LinuxMakefile$ make CONFIG=Release
    Compiling include_hi_core.cpp
    In file included from ../../../../../HISE/hi_backend/../hi_modules/../hi_scripting/../hi_sampler/../hi_components/../hi_dsp/../hi_core/hi_core/hi_core.h:91:0,
                     from ../../../../../HISE/hi_backend/../hi_modules/../hi_scripting/../hi_sampler/../hi_components/../hi_dsp/../hi_core/hi_core.h:334,
                     from ../../../../../HISE/hi_backend/../hi_modules/../hi_scripting/../hi_sampler/../hi_components/../hi_dsp/hi_dsp.h:55,
                     from ../../../../../HISE/hi_backend/../hi_modules/../hi_scripting/../hi_sampler/../hi_components/hi_components.h:57,
                     from ../../../../../HISE/hi_backend/../hi_modules/../hi_scripting/../hi_sampler/hi_sampler.h:54,
                     from ../../../../../HISE/hi_backend/../hi_modules/../hi_scripting/hi_scripting.h:61,
                     from ../../../../../HISE/hi_backend/../hi_modules/hi_modules.h:57,
                     from ../../../../../HISE/hi_backend/hi_backend.h:55,
                     from ../../JuceLibraryCode/JuceHeader.h:17,
                     from ../../../../../HISE/hi_core/hi_core.cpp:13,
                     from ../../JuceLibraryCode/include_hi_core.cpp:9:
    ../../../../../HISE/hi_backend/../hi_modules/../hi_scripting/../hi_sampler/../hi_components/../hi_dsp/../hi_core/hi_core/ExternalFilePool.h: In member function ‘void hise::SharedPoolBase<DataType>::loadAllFilesFromProjectFolder()’:
    ../../../../../HISE/hi_backend/../hi_modules/../hi_scripting/../hi_sampler/../hi_components/../hi_dsp/../hi_core/hi_core/ExternalFilePool.h:837:38: warning: invalid use of incomplete type ‘class hise::MainController’
       auto fileList = getMainController()->getCurrentFileHandler().getFileList(type, false, true);
                                          ^~
    In file included from ../../../../../HISE/hi_backend/../hi_modules/../hi_scripting/../hi_sampler/../hi_components/../hi_dsp/../hi_core/hi_core/hi_core.h:78:0,
                     from ../../../../../HISE/hi_backend/../hi_modules/../hi_scripting/../hi_sampler/../hi_components/../hi_dsp/../hi_core/hi_core.h:334,
                     from ../../../../../HISE/hi_backend/../hi_modules/../hi_scripting/../hi_sampler/../hi_components/../hi_dsp/hi_dsp.h:55,
                     from ../../../../../HISE/hi_backend/../hi_modules/../hi_scripting/../hi_sampler/../hi_components/hi_components.h:57,
                     from ../../../../../HISE/hi_backend/../hi_modules/../hi_scripting/../hi_sampler/hi_sampler.h:54,
                     from ../../../../../HISE/hi_backend/../hi_modules/../hi_scripting/hi_scripting.h:61,
                     from ../../../../../HISE/hi_backend/../hi_modules/hi_modules.h:57,
                     from ../../../../../HISE/hi_backend/hi_backend.h:55,
                     from ../../JuceLibraryCode/JuceHeader.h:17,
                     from ../../../../../HISE/hi_core/hi_core.cpp:13,
                     from ../../JuceLibraryCode/include_hi_core.cpp:9:
    ../../../../../HISE/hi_backend/../hi_modules/../hi_scripting/../hi_sampler/../hi_components/../hi_dsp/../hi_core/hi_core/UtilityClasses.h:39:7: note: forward declaration of ‘class hise::MainController’
     class MainController;
           ^~~~~~~~~~~~~~
    In file included from ../../../../../HISE/hi_backend/../hi_modules/../hi_scripting/../hi_sampler/../hi_components/../hi_dsp/../hi_core/hi_core/hi_core.h:91:0,
                     from ../../../../../HISE/hi_backend/../hi_modules/../hi_scripting/../hi_sampler/../hi_components/../hi_dsp/../hi_core/hi_core.h:334,
                     from ../../../../../HISE/hi_backend/../hi_modules/../hi_scripting/../hi_sampler/../hi_components/../hi_dsp/hi_dsp.h:55,
                     from ../../../../../HISE/hi_backend/../hi_modules/../hi_scripting/../hi_sampler/../hi_components/hi_components.h:57,
                     from ../../../../../HISE/hi_backend/../hi_modules/../hi_scripting/../hi_sampler/hi_sampler.h:54,
                     from ../../../../../HISE/hi_backend/../hi_modules/../hi_scripting/hi_scripting.h:61,
                     from ../../../../../HISE/hi_backend/../hi_modules/hi_modules.h:57,
                     from ../../../../../HISE/hi_backend/hi_backend.h:55,
                     from ../../JuceLibraryCode/JuceHeader.h:17,
                     from ../../../../../HISE/hi_core/hi_core.cpp:13,
                     from ../../JuceLibraryCode/include_hi_core.cpp:9:
    ../../../../../HISE/hi_backend/../hi_modules/../hi_scripting/../hi_sampler/../hi_components/../hi_dsp/../hi_core/hi_core/ExternalFilePool.h: In member function ‘hise::SharedPoolBase<DataType>::ManagedPtr hise::SharedPoolBase<DataType>::loadFromReference(hise::PoolReference, hise::PoolHelpers::LoadingType)’:
    ../../../../../HISE/hi_backend/../hi_modules/../hi_scripting/../hi_sampler/../hi_components/../hi_dsp/../hi_core/hi_core/ExternalFilePool.h:975:26: warning: invalid use of incomplete type ‘class hise::MainController’
           getMainController()->getDebugLogger().logMessage(r.getReferenceString() + " wasn't found.");
                              ^~
    In file included from ../../../../../HISE/hi_backend/../hi_modules/../hi_scripting/../hi_sampler/../hi_components/../hi_dsp/../hi_core/hi_core/hi_core.h:78:0,
                     from ../../../../../HISE/hi_backend/../hi_modules/../hi_scripting/../hi_sampler/../hi_components/../hi_dsp/../hi_core/hi_core.h:334,
                     from ../../../../../HISE/hi_backend/../hi_modules/../hi_scripting/../hi_sampler/../hi_components/../hi_dsp/hi_dsp.h:55,
                     from ../../../../../HISE/hi_backend/../hi_modules/../hi_scripting/../hi_sampler/../hi_components/hi_components.h:57,
                     from ../../../../../HISE/hi_backend/../hi_modules/../hi_scripting/../hi_sampler/hi_sampler.h:54,
                     from ../../../../../HISE/hi_backend/../hi_modules/../hi_scripting/hi_scripting.h:61,
                     from ../../../../../HISE/hi_backend/../hi_modules/hi_modules.h:57,
                     from ../../../../../HISE/hi_backend/hi_backend.h:55,
                     from ../../JuceLibraryCode/JuceHeader.h:17,
                     from ../../../../../HISE/hi_core/hi_core.cpp:13,
                     from ../../JuceLibraryCode/include_hi_core.cpp:9:
    ../../../../../HISE/hi_backend/../hi_modules/../hi_scripting/../hi_sampler/../hi_components/../hi_dsp/../hi_core/hi_core/UtilityClasses.h:39:7: note: forward declaration of ‘class hise::MainController’
     class MainController;
           ^~~~~~~~~~~~~~
    In file included from ../../../../../HISE/hi_backend/../hi_modules/../hi_scripting/../hi_sampler/../hi_components/../hi_dsp/../hi_core/hi_core/hi_core.h:91:0,
                     from ../../../../../HISE/hi_backend/../hi_modules/../hi_scripting/../hi_sampler/../hi_components/../hi_dsp/../hi_core/hi_core.h:334,
                     from ../../../../../HISE/hi_backend/../hi_modules/../hi_scripting/../hi_sampler/../hi_components/../hi_dsp/hi_dsp.h:55,
                     from ../../../../../HISE/hi_backend/../hi_modules/../hi_scripting/../hi_sampler/../hi_components/hi_components.h:57,
                     from ../../../../../HISE/hi_backend/../hi_modules/../hi_scripting/../hi_sampler/hi_sampler.h:54,
                     from ../../../../../HISE/hi_backend/../hi_modules/../hi_scripting/hi_scripting.h:61,
                     from ../../../../../HISE/hi_backend/../hi_modules/hi_modules.h:57,
                     from ../../../../../HISE/hi_backend/hi_backend.h:55,
                     from ../../JuceLibraryCode/JuceHeader.h:17,
                     from ../../../../../HISE/hi_core/hi_core.cpp:13,
                     from ../../JuceLibraryCode/include_hi_core.cpp:9:
    ../../../../../HISE/hi_backend/../hi_modules/../hi_scripting/../hi_sampler/../hi_components/../hi_dsp/../hi_core/hi_core/ExternalFilePool.h:1054:24: warning: invalid use of incomplete type ‘class hise::MainController’
         getMainController()->getDebugLogger().logMessage(r.getReferenceString() + " wasn't found.");
                            ^~
    In file included from ../../../../../HISE/hi_backend/../hi_modules/../hi_scripting/../hi_sampler/../hi_components/../hi_dsp/../hi_core/hi_core/hi_core.h:78:0,
                     from ../../../../../HISE/hi_backend/../hi_modules/../hi_scripting/../hi_sampler/../hi_components/../hi_dsp/../hi_core/hi_core.h:334,
                     from ../../../../../HISE/hi_backend/../hi_modules/../hi_scripting/../hi_sampler/../hi_components/../hi_dsp/hi_dsp.h:55,
                     from ../../../../../HISE/hi_backend/../hi_modules/../hi_scripting/../hi_sampler/../hi_components/hi_components.h:57,
                     from ../../../../../HISE/hi_backend/../hi_modules/../hi_scripting/../hi_sampler/hi_sampler.h:54,
                     from ../../../../../HISE/hi_backend/../hi_modules/../hi_scripting/hi_scripting.h:61,
                     from ../../../../../HISE/hi_backend/../hi_modules/hi_modules.h:57,
                     from ../../../../../HISE/hi_backend/hi_backend.h:55,
                     from ../../JuceLibraryCode/JuceHeader.h:17,
                     from ../../../../../HISE/hi_core/hi_core.cpp:13,
                     from ../../JuceLibraryCode/include_hi_core.cpp:9:
    ../../../../../HISE/hi_backend/../hi_modules/../hi_scripting/../hi_sampler/../hi_components/../hi_dsp/../hi_core/hi_core/UtilityClasses.h:39:7: note: forward declaration of ‘class hise::MainController’
     class MainController;
           ^~~~~~~~~~~~~~
    In file included from ../../../../../HISE/hi_backend/../hi_modules/../hi_scripting/../hi_sampler/../hi_components/floating_layout/FloatingLayout.h:59:0,
                     from ../../../../../HISE/hi_backend/../hi_modules/../hi_scripting/../hi_sampler/../hi_components/hi_components.h:101,
                     from ../../../../../HISE/hi_backend/../hi_modules/../hi_scripting/../hi_sampler/hi_sampler.h:54,
                     from ../../../../../HISE/hi_backend/../hi_modules/../hi_scripting/hi_scripting.h:61,
                     from ../../../../../HISE/hi_backend/../hi_modules/hi_modules.h:57,
                     from ../../../../../HISE/hi_backend/hi_backend.h:55,
                     from ../../JuceLibraryCode/JuceHeader.h:17,
                     from ../../../../../HISE/hi_core/hi_core.cpp:13,
                     from ../../JuceLibraryCode/include_hi_core.cpp:9:
    ../../../../../HISE/hi_backend/../hi_modules/../hi_scripting/../hi_sampler/../hi_components/floating_layout/MiscFloatingPanelTypes.h: In member function ‘void hise::GenericPanel<ContentType>::resized()’:
    ../../../../../HISE/hi_backend/../hi_modules/../hi_scripting/../hi_sampler/../hi_components/floating_layout/MiscFloatingPanelTypes.h:637:40: warning: invalid use of incomplete type ‘class hise::FloatingTile’
       component->setBounds(getParentShell()->getContentBounds());
                                            ^~
    In file included from ../../../../../HISE/hi_backend/../hi_modules/../hi_scripting/../hi_sampler/../hi_components/../hi_dsp/../hi_core/hi_core/hi_core.h:94:0,
                     from ../../../../../HISE/hi_backend/../hi_modules/../hi_scripting/../hi_sampler/../hi_components/../hi_dsp/../hi_core/hi_core.h:334,
                     from ../../../../../HISE/hi_backend/../hi_modules/../hi_scripting/../hi_sampler/../hi_components/../hi_dsp/hi_dsp.h:55,
                     from ../../../../../HISE/hi_backend/../hi_modules/../hi_scripting/../hi_sampler/../hi_components/hi_components.h:57,
                     from ../../../../../HISE/hi_backend/../hi_modules/../hi_scripting/../hi_sampler/hi_sampler.h:54,
                     from ../../../../../HISE/hi_backend/../hi_modules/../hi_scripting/hi_scripting.h:61,
                     from ../../../../../HISE/hi_backend/../hi_modules/hi_modules.h:57,
                     from ../../../../../HISE/hi_backend/hi_backend.h:55,
                     from ../../JuceLibraryCode/JuceHeader.h:17,
                     from ../../../../../HISE/hi_core/hi_core.cpp:13,
                     from ../../JuceLibraryCode/include_hi_core.cpp:9:
    ../../../../../HISE/hi_backend/../hi_modules/../hi_scripting/../hi_sampler/../hi_components/../hi_dsp/../hi_core/hi_core/ExpansionHandler.h:39:7: note: forward declaration of ‘class hise::FloatingTile’
     class FloatingTile;
           ^~~~~~~~~~~~
    ../../../../../HISE/hi_core/hi_core/StandaloneProcessor.cpp: At top level:
    cc1plus: warning: unrecognized command line option ‘-Wno-inconsistent-missing-override’
    Compiling include_hi_dsp.cpp
    In file included from ../../../../../HISE/hi_backend/../hi_modules/../hi_scripting/../hi_sampler/../hi_components/../hi_dsp/../hi_core/hi_core/hi_core.h:91:0,
                     from ../../../../../HISE/hi_backend/../hi_modules/../hi_scripting/../hi_sampler/../hi_components/../hi_dsp/../hi_core/hi_core.h:334,
                     from ../../../../../HISE/hi_backend/../hi_modules/../hi_scripting/../hi_sampler/../hi_components/../hi_dsp/hi_dsp.h:55,
                     from ../../../../../HISE/hi_backend/../hi_modules/../hi_scripting/../hi_sampler/../hi_components/hi_components.h:57,
                     from ../../../../../HISE/hi_backend/../hi_modules/../hi_scripting/../hi_sampler/hi_sampler.h:54,
                     from ../../../../../HISE/hi_backend/../hi_modules/../hi_scripting/hi_scripting.h:61,
                     from ../../../../../HISE/hi_backend/../hi_modules/hi_modules.h:57,
                     from ../../../../../HISE/hi_backend/hi_backend.h:55,
                     from ../../JuceLibraryCode/JuceHeader.h:17,
                     from ../../../../../HISE/hi_dsp/hi_dsp.cpp:33,
                     from ../../JuceLibraryCode/include_hi_dsp.cpp:9:
    ../../../../../HISE/hi_backend/../hi_modules/../hi_scripting/../hi_sampler/../hi_components/../hi_dsp/../hi_core/hi_core/ExternalFilePool.h: In member function ‘void hise::SharedPoolBase<DataType>::loadAllFilesFromProjectFolder()’:
    ../../../../../HISE/hi_backend/../hi_modules/../hi_scripting/../hi_sampler/../hi_components/../hi_dsp/../hi_core/hi_core/ExternalFilePool.h:837:38: warning: invalid use of incomplete type ‘class hise::MainController’
       auto fileList = getMainController()->getCurrentFileHandler().getFileList(type, false, true);
                                          ^~
    In file included from ../../../../../HISE/hi_backend/../hi_modules/../hi_scripting/../hi_sampler/../hi_components/../hi_dsp/../hi_core/hi_core/hi_core.h:78:0,
                     from ../../../../../HISE/hi_backend/../hi_modules/../hi_scripting/../hi_sampler/../hi_components/../hi_dsp/../hi_core/hi_core.h:334,
                     from ../../../../../HISE/hi_backend/../hi_modules/../hi_scripting/../hi_sampler/../hi_components/../hi_dsp/hi_dsp.h:55,
                     from ../../../../../HISE/hi_backend/../hi_modules/../hi_scripting/../hi_sampler/../hi_components/hi_components.h:57,
                     from ../../../../../HISE/hi_backend/../hi_modules/../hi_scripting/../hi_sampler/hi_sampler.h:54,
                     from ../../../../../HISE/hi_backend/../hi_modules/../hi_scripting/hi_scripting.h:61,
                     from ../../../../../HISE/hi_backend/../hi_modules/hi_modules.h:57,
                     from ../../../../../HISE/hi_backend/hi_backend.h:55,
                     from ../../JuceLibraryCode/JuceHeader.h:17,
                     from ../../../../../HISE/hi_dsp/hi_dsp.cpp:33,
                     from ../../JuceLibraryCode/include_hi_dsp.cpp:9:
    ../../../../../HISE/hi_backend/../hi_modules/../hi_scripting/../hi_sampler/../hi_components/../hi_dsp/../hi_core/hi_core/UtilityClasses.h:39:7: note: forward declaration of ‘class hise::MainController’
     class MainController;
           ^~~~~~~~~~~~~~
    In file included from ../../../../../HISE/hi_backend/../hi_modules/../hi_scripting/../hi_sampler/../hi_components/../hi_dsp/../hi_core/hi_core/hi_core.h:91:0,
                     from ../../../../../HISE/hi_backend/../hi_modules/../hi_scripting/../hi_sampler/../hi_components/../hi_dsp/../hi_core/hi_core.h:334,
                     from ../../../../../HISE/hi_backend/../hi_modules/../hi_scripting/../hi_sampler/../hi_components/../hi_dsp/hi_dsp.h:55,
                     from ../../../../../HISE/hi_backend/../hi_modules/../hi_scripting/../hi_sampler/../hi_components/hi_components.h:57,
                     from ../../../../../HISE/hi_backend/../hi_modules/../hi_scripting/../hi_sampler/hi_sampler.h:54,
                     from ../../../../../HISE/hi_backend/../hi_modules/../hi_scripting/hi_scripting.h:61,
                     from ../../../../../HISE/hi_backend/../hi_modules/hi_modules.h:57,
                     from ../../../../../HISE/hi_backend/hi_backend.h:55,
                     from ../../JuceLibraryCode/JuceHeader.h:17,
                     from ../../../../../HISE/hi_dsp/hi_dsp.cpp:33,
                     from ../../JuceLibraryCode/include_hi_dsp.cpp:9:
    ../../../../../HISE/hi_backend/../hi_modules/../hi_scripting/../hi_sampler/../hi_components/../hi_dsp/../hi_core/hi_core/ExternalFilePool.h: In member function ‘hise::SharedPoolBase<DataType>::ManagedPtr hise::SharedPoolBase<DataType>::loadFromReference(hise::PoolReference, hise::PoolHelpers::LoadingType)’:
    ../../../../../HISE/hi_backend/../hi_modules/../hi_scripting/../hi_sampler/../hi_components/../hi_dsp/../hi_core/hi_core/ExternalFilePool.h:975:26: warning: invalid use of incomplete type ‘class hise::MainController’
           getMainController()->getDebugLogger().logMessage(r.getReferenceString() + " wasn't found.");
                              ^~
    In file included from ../../../../../HISE/hi_backend/../hi_modules/../hi_scripting/../hi_sampler/../hi_components/../hi_dsp/../hi_core/hi_core/hi_core.h:78:0,
                     from ../../../../../HISE/hi_backend/../hi_modules/../hi_scripting/../hi_sampler/../hi_components/../hi_dsp/../hi_core/hi_core.h:334,
                     from ../../../../../HISE/hi_backend/../hi_modules/../hi_scripting/../hi_sampler/../hi_components/../hi_dsp/hi_dsp.h:55,
                     from ../../../../../HISE/hi_backend/../hi_modules/../hi_scripting/../hi_sampler/../hi_components/hi_components.h:57,
                     from ../../../../../HISE/hi_backend/../hi_modules/../hi_scripting/../hi_sampler/hi_sampler.h:54,
                     from ../../../../../HISE/hi_backend/../hi_modules/../hi_scripting/hi_scripting.h:61,
                     from ../../../../../HISE/hi_backend/../hi_modules/hi_modules.h:57,
                     from ../../../../../HISE/hi_backend/hi_backend.h:55,
                     from ../../JuceLibraryCode/JuceHeader.h:17,
                     from ../../../../../HISE/hi_dsp/hi_dsp.cpp:33,
                     from ../../JuceLibraryCode/include_hi_dsp.cpp:9:
    ../../../../../HISE/hi_backend/../hi_modules/../hi_scripting/../hi_sampler/../hi_components/../hi_dsp/../hi_core/hi_core/UtilityClasses.h:39:7: note: forward declaration of ‘class hise::MainController’
     class MainController;
           ^~~~~~~~~~~~~~
    In file included from ../../../../../HISE/hi_backend/../hi_modules/../hi_scripting/../hi_sampler/../hi_components/../hi_dsp/../hi_core/hi_core/hi_core.h:91:0,
                     from ../../../../../HISE/hi_backend/../hi_modules/../hi_scripting/../hi_sampler/../hi_components/../hi_dsp/../hi_core/hi_core.h:334,
                     from ../../../../../HISE/hi_backend/../hi_modules/../hi_scripting/../hi_sampler/../hi_components/../hi_dsp/hi_dsp.h:55,
                     from ../../../../../HISE/hi_backend/../hi_modules/../hi_scripting/../hi_sampler/../hi_components/hi_components.h:57,
                     from ../../../../../HISE/hi_backend/../hi_modules/../hi_scripting/../hi_sampler/hi_sampler.h:54,
                     from ../../../../../HISE/hi_backend/../hi_modules/../hi_scripting/hi_scripting.h:61,
                     from ../../../../../HISE/hi_backend/../hi_modules/hi_modules.h:57,
                     from ../../../../../HISE/hi_backend/hi_backend.h:55,
                     from ../../JuceLibraryCode/JuceHeader.h:17,
                     from ../../../../../HISE/hi_dsp/hi_dsp.cpp:33,
                     from ../../JuceLibraryCode/include_hi_dsp.cpp:9:
    ../../../../../HISE/hi_backend/../hi_modules/../hi_scripting/../hi_sampler/../hi_components/../hi_dsp/../hi_core/hi_core/ExternalFilePool.h:1054:24: warning: invalid use of incomplete type ‘class hise::MainController’
         getMainController()->getDebugLogger().logMessage(r.getReferenceString() + " wasn't found.");
                            ^~
    In file included from ../../../../../HISE/hi_backend/../hi_modules/../hi_scripting/../hi_sampler/../hi_components/../hi_dsp/../hi_core/hi_core/hi_core.h:78:0,
                     from ../../../../../HISE/hi_backend/../hi_modules/../hi_scripting/../hi_sampler/../hi_components/../hi_dsp/../hi_core/hi_core.h:334,
                     from ../../../../../HISE/hi_backend/../hi_modules/../hi_scripting/../hi_sampler/../hi_components/../hi_dsp/hi_dsp.h:55,
                     from ../../../../../HISE/hi_backend/../hi_modules/../hi_scripting/../hi_sampler/../hi_components/hi_components.h:57,
                     from ../../../../../HISE/hi_backend/../hi_modules/../hi_scripting/../hi_sampler/hi_sampler.h:54,
                     from ../../../../../HISE/hi_backend/../hi_modules/../hi_scripting/hi_scripting.h:61,
                     from ../../../../../HISE/hi_backend/../hi_modules/hi_modules.h:57,
                     from ../../../../../HISE/hi_backend/hi_backend.h:55,
                     from ../../JuceLibraryCode/JuceHeader.h:17,
                     from ../../../../../HISE/hi_dsp/hi_dsp.cpp:33,
                     from ../../JuceLibraryCode/include_hi_dsp.cpp:9:
    ../../../../../HISE/hi_backend/../hi_modules/../hi_scripting/../hi_sampler/../hi_components/../hi_dsp/../hi_core/hi_core/UtilityClasses.h:39:7: note: forward declaration of ‘class hise::MainController’
     class MainController;
           ^~~~~~~~~~~~~~
    In file included from ../../../../../HISE/hi_backend/../hi_modules/../hi_scripting/../hi_sampler/../hi_components/floating_layout/FloatingLayout.h:59:0,
                     from ../../../../../HISE/hi_backend/../hi_modules/../hi_scripting/../hi_sampler/../hi_components/hi_components.h:101,
                     from ../../../../../HISE/hi_backend/../hi_modules/../hi_scripting/../hi_sampler/hi_sampler.h:54,
                     from ../../../../../HISE/hi_backend/../hi_modules/../hi_scripting/hi_scripting.h:61,
                     from ../../../../../HISE/hi_backend/../hi_modules/hi_modules.h:57,
                     from ../../../../../HISE/hi_backend/hi_backend.h:55,
                     from ../../JuceLibraryCode/JuceHeader.h:17,
                     from ../../../../../HISE/hi_dsp/hi_dsp.cpp:33,
                     from ../../JuceLibraryCode/include_hi_dsp.cpp:9:
    ../../../../../HISE/hi_backend/../hi_modules/../hi_scripting/../hi_sampler/../hi_components/floating_layout/MiscFloatingPanelTypes.h: In member function ‘void hise::GenericPanel<ContentType>::resized()’:
    ../../../../../HISE/hi_backend/../hi_modules/../hi_scripting/../hi_sampler/../hi_components/floating_layout/MiscFloatingPanelTypes.h:637:40: warning: invalid use of incomplete type ‘class hise::FloatingTile’
       component->setBounds(getParentShell()->getContentBounds());
                                            ^~
    In file included from ../../../../../HISE/hi_backend/../hi_modules/../hi_scripting/../hi_sampler/../hi_components/../hi_dsp/../hi_core/hi_core/hi_core.h:94:0,
                     from ../../../../../HISE/hi_backend/../hi_modules/../hi_scripting/../hi_sampler/../hi_components/../hi_dsp/../hi_core/hi_core.h:334,
                     from ../../../../../HISE/hi_backend/../hi_modules/../hi_scripting/../hi_sampler/../hi_components/../hi_dsp/hi_dsp.h:55,
                     from ../../../../../HISE/hi_backend/../hi_modules/../hi_scripting/../hi_sampler/../hi_components/hi_components.h:57,
                     from ../../../../../HISE/hi_backend/../hi_modules/../hi_scripting/../hi_sampler/hi_sampler.h:54,
                     from ../../../../../HISE/hi_backend/../hi_modules/../hi_scripting/hi_scripting.h:61,
                     from ../../../../../HISE/hi_backend/../hi_modules/hi_modules.h:57,
                     from ../../../../../HISE/hi_backend/hi_backend.h:55,
                     from ../../JuceLibraryCode/JuceHeader.h:17,
                     from ../../../../../HISE/hi_dsp/hi_dsp.cpp:33,
                     from ../../JuceLibraryCode/include_hi_dsp.cpp:9:
    ../../../../../HISE/hi_backend/../hi_modules/../hi_scripting/../hi_sampler/../hi_components/../hi_dsp/../hi_core/hi_core/ExpansionHandler.h:39:7: note: forward declaration of ‘class hise::FloatingTile’
     class FloatingTile;
           ^~~~~~~~~~~~
    In file included from ../../../../../HISE/hi_backend/../hi_modules/../hi_scripting/../hi_sampler/../hi_components/../hi_dsp/../hi_core/../JUCE/modules/juce_core/juce_core.h:240:0,
                     from ../../../../../HISE/hi_backend/../hi_modules/../hi_scripting/../hi_sampler/../hi_components/../hi_dsp/../hi_core/hi_core.h:65,
                     from ../../../../../HISE/hi_backend/../hi_modules/../hi_scripting/../hi_sampler/../hi_components/../hi_dsp/hi_dsp.h:55,
                     from ../../../../../HISE/hi_backend/../hi_modules/../hi_scripting/../hi_sampler/../hi_components/hi_components.h:57,
                     from ../../../../../HISE/hi_backend/../hi_modules/../hi_scripting/../hi_sampler/hi_sampler.h:54,
                     from ../../../../../HISE/hi_backend/../hi_modules/../hi_scripting/hi_scripting.h:61,
                     from ../../../../../HISE/hi_backend/../hi_modules/hi_modules.h:57,
                     from ../../../../../HISE/hi_backend/hi_backend.h:55,
                     from ../../JuceLibraryCode/JuceHeader.h:17,
                     from ../../../../../HISE/hi_dsp/hi_dsp.cpp:33,
                     from ../../JuceLibraryCode/include_hi_dsp.cpp:9:
    ../../../../../HISE/hi_backend/../hi_modules/../hi_scripting/../hi_sampler/../hi_components/../hi_dsp/../hi_core/../JUCE/modules/juce_core/memory/juce_ReferenceCountedObject.h: In function ‘juce::ReferenceCountedObjectPtr<juce::WeakReference<hise::JavascriptProcessor, juce::ReferenceCountedObject>::SharedPointer>::decIfNotNull(juce::WeakReference<hise::JavascriptProcessor, juce::ReferenceCountedObject>::SharedPointer*)’:
    ../../../../../HISE/hi_backend/../hi_modules/../hi_scripting/../hi_sampler/../hi_components/../hi_dsp/../hi_core/../JUCE/modules/juce_core/memory/juce_ReferenceCountedObject.h:372:60: internal compiler error: Segmentation fault
                 ContainerDeletePolicy<ReferencedType>::destroy (o);
                 ~~~~~~~~~~~~~~~~~~~~~~~~~~~~~~~~~~~~~~~~~~~~~~~^~~
    Please submit a full bug report,
    with preprocessed source if appropriate.
    See <file:///usr/share/doc/gcc-7/README.Bugs> for instructions.
    Makefile:177: recipe for target 'build/intermediate/Release/include_hi_dsp_8e162ae3.o' failed
    make: *** [build/intermediate/Release/include_hi_dsp_8e162ae3.o] Error 1
    


  • also have a problem with building standalone HISE (lastest release) on ubuntu 18.10 within XFICE

    Compiling include_juce_audio_devices.cpp
    In file included from ../../JuceLibraryCode/include_juce_audio_devices.cpp:9:0:
    ../../../../JUCE/modules/juce_audio_devices/juce_audio_devices.cpp:143:12: fatal error: jack/jack.h: Нет такого файла или каталога
       #include <jack/jack.h>
                ^~~~~~~~~~~~~
    compilation terminated.
    Makefile:237: recipe for target 'build/intermediate/Release/include_juce_audio_devices_63111d02.o' failed
    make: *** [build/intermediate/Release/include_juce_audio_devices_63111d02.o] Error 1
    
    

    installed jack, but, seemed, something is still missing



  • You will have to compile it. The not a programmer route won't help you since you need to be able to compile HISE in order to export any plugins you create with it.



  • @d-healey said in Installing problem in ubuntu 18.04:

    You will have to compile it

    Do You mean the Jack?



  • @Levitanus Your problem is different. I've mentioned this a couple of times to Christoph that there is a dependency missing from the list on github. You need to install jackd2-dev - sudo apt-get install libjack-jackd2-dev

    There is a whole thread of GNU/Linux info - https://forum.hise.audio/topic/53/linux-build-of-hise - which you might find useful.



  • Good day all! Great mood before a holiday! Hise compiled on Fedora 28 xfce.
    But (base Ubuntu 18.04) everything works at Peppermint linux 9.
    It is necessary to set alternative libraries for the correct compilation.
    libgtk-3-0
    libgtk-3-common
    libjack-jackd2-dev

    Download:

    https://mega.nz/#!GT4XkIaR!hA0adfxyuK7GYMKN4n50cTzImg9Rn-LtQ4flWLUJVQ4

    Perhaps someone will be helped by the compiled version for other systems.
    But for other distribution kits it is necessary to look for the relevant libraries.


 

1
Online

384
Users

1.2k
Topics

8.8k
Posts